CTestTestfile.cmake
Go to the documentation of this file.
1 # CMake generated Testfile for
2 # Source directory: /builds/gitlab-kitware-sciviz-ci/Examples/Catalyst2
3 # Build directory: /builds/gitlab-kitware-sciviz-ci/build/Examples/Catalyst2
4 #
5 # This file includes the relevant testing commands required for
6 # testing this directory and lists subdirectories to be tested as well.
7 add_test(contract-paraview-CUnstructuredGrid "/builds/gitlab-kitware-sciviz-ci/.gitlab/cmake/bin/ctest" "--build-and-test" "/builds/gitlab-kitware-sciviz-ci/build/ContractTests/5ea8b827/src" "/builds/gitlab-kitware-sciviz-ci/build/ContractTests/5ea8b827/build" "--build-generator" "Ninja" "--build-makeprogram" "/builds/gitlab-kitware-sciviz-ci/.gitlab/ninja" "--build-options" "-DBUILD_SHARED_LIBS:BOOL=ON" "-DBUILD_TESTING=ON" "-DCMAKE_BUILD_TYPE=Release" "-Dcatalyst_DIR=/usr/lib64/openmpi/lib/cmake/catalyst-2.0" "-DParaViewCatalyst_DIR=/builds/gitlab-kitware-sciviz-ci/build/lib64/catalyst" "-DCATALYST_EXAMPLES_CONTRACT_TAG:STRING=ParaViewCI-25.07")
8 set_tests_properties(contract-paraview-CUnstructuredGrid PROPERTIES ENVIRONMENT "CTEST_OUTPUT_ON_FAILURE=1" LABELS "ParaViewContract" RUN_SERIAL "TRUE" _BACKTRACE_TRIPLES "/builds/gitlab-kitware-sciviz-ci/CMake/ParaViewContractTesting.cmake;85;add_test;/builds/gitlab-kitware-sciviz-ci/Examples/Catalyst2/CMakeLists.txt;12;paraview_contract_test;/builds/gitlab-kitware-sciviz-ci/Examples/Catalyst2/CMakeLists.txt;0;")
9 add_test(contract-paraview-CxxImageData "/builds/gitlab-kitware-sciviz-ci/.gitlab/cmake/bin/ctest" "--build-and-test" "/builds/gitlab-kitware-sciviz-ci/build/ContractTests/17b45d8b/src" "/builds/gitlab-kitware-sciviz-ci/build/ContractTests/17b45d8b/build" "--build-generator" "Ninja" "--build-makeprogram" "/builds/gitlab-kitware-sciviz-ci/.gitlab/ninja" "--build-options" "-DBUILD_SHARED_LIBS:BOOL=ON" "-DBUILD_TESTING=ON" "-DCMAKE_BUILD_TYPE=Release" "-Dcatalyst_DIR=/usr/lib64/openmpi/lib/cmake/catalyst-2.0" "-DParaViewCatalyst_DIR=/builds/gitlab-kitware-sciviz-ci/build/lib64/catalyst" "-DCATALYST_EXAMPLES_CONTRACT_TAG:STRING=ParaViewCI-25.07")
10 set_tests_properties(contract-paraview-CxxImageData PROPERTIES ENVIRONMENT "CTEST_OUTPUT_ON_FAILURE=1" LABELS "ParaViewContract" RUN_SERIAL "TRUE" _BACKTRACE_TRIPLES "/builds/gitlab-kitware-sciviz-ci/CMake/ParaViewContractTesting.cmake;85;add_test;/builds/gitlab-kitware-sciviz-ci/Examples/Catalyst2/CMakeLists.txt;12;paraview_contract_test;/builds/gitlab-kitware-sciviz-ci/Examples/Catalyst2/CMakeLists.txt;0;")
11 add_test(contract-paraview-CxxMultiChannelInput "/builds/gitlab-kitware-sciviz-ci/.gitlab/cmake/bin/ctest" "--build-and-test" "/builds/gitlab-kitware-sciviz-ci/build/ContractTests/5b370a97/src" "/builds/gitlab-kitware-sciviz-ci/build/ContractTests/5b370a97/build" "--build-generator" "Ninja" "--build-makeprogram" "/builds/gitlab-kitware-sciviz-ci/.gitlab/ninja" "--build-options" "-DBUILD_SHARED_LIBS:BOOL=ON" "-DBUILD_TESTING=ON" "-DCMAKE_BUILD_TYPE=Release" "-Dcatalyst_DIR=/usr/lib64/openmpi/lib/cmake/catalyst-2.0" "-DParaViewCatalyst_DIR=/builds/gitlab-kitware-sciviz-ci/build/lib64/catalyst" "-DCATALYST_EXAMPLES_CONTRACT_TAG:STRING=ParaViewCI-25.07")
12 set_tests_properties(contract-paraview-CxxMultiChannelInput PROPERTIES ENVIRONMENT "CTEST_OUTPUT_ON_FAILURE=1" LABELS "ParaViewContract" RUN_SERIAL "TRUE" _BACKTRACE_TRIPLES "/builds/gitlab-kitware-sciviz-ci/CMake/ParaViewContractTesting.cmake;85;add_test;/builds/gitlab-kitware-sciviz-ci/Examples/Catalyst2/CMakeLists.txt;12;paraview_contract_test;/builds/gitlab-kitware-sciviz-ci/Examples/Catalyst2/CMakeLists.txt;0;")
13 add_test(contract-paraview-CxxMultimesh "/builds/gitlab-kitware-sciviz-ci/.gitlab/cmake/bin/ctest" "--build-and-test" "/builds/gitlab-kitware-sciviz-ci/build/ContractTests/c25a8b98/src" "/builds/gitlab-kitware-sciviz-ci/build/ContractTests/c25a8b98/build" "--build-generator" "Ninja" "--build-makeprogram" "/builds/gitlab-kitware-sciviz-ci/.gitlab/ninja" "--build-options" "-DBUILD_SHARED_LIBS:BOOL=ON" "-DBUILD_TESTING=ON" "-DCMAKE_BUILD_TYPE=Release" "-Dcatalyst_DIR=/usr/lib64/openmpi/lib/cmake/catalyst-2.0" "-DParaViewCatalyst_DIR=/builds/gitlab-kitware-sciviz-ci/build/lib64/catalyst" "-DCATALYST_EXAMPLES_CONTRACT_TAG:STRING=ParaViewCI-25.07")
14 set_tests_properties(contract-paraview-CxxMultimesh PROPERTIES ENVIRONMENT "CTEST_OUTPUT_ON_FAILURE=1" LABELS "ParaViewContract" RUN_SERIAL "TRUE" _BACKTRACE_TRIPLES "/builds/gitlab-kitware-sciviz-ci/CMake/ParaViewContractTesting.cmake;85;add_test;/builds/gitlab-kitware-sciviz-ci/Examples/Catalyst2/CMakeLists.txt;12;paraview_contract_test;/builds/gitlab-kitware-sciviz-ci/Examples/Catalyst2/CMakeLists.txt;0;")
15 add_test(contract-paraview-CxxOverlappingAMR "/builds/gitlab-kitware-sciviz-ci/.gitlab/cmake/bin/ctest" "--build-and-test" "/builds/gitlab-kitware-sciviz-ci/build/ContractTests/ad730956/src" "/builds/gitlab-kitware-sciviz-ci/build/ContractTests/ad730956/build" "--build-generator" "Ninja" "--build-makeprogram" "/builds/gitlab-kitware-sciviz-ci/.gitlab/ninja" "--build-options" "-DBUILD_SHARED_LIBS:BOOL=ON" "-DBUILD_TESTING=ON" "-DCMAKE_BUILD_TYPE=Release" "-Dcatalyst_DIR=/usr/lib64/openmpi/lib/cmake/catalyst-2.0" "-DParaViewCatalyst_DIR=/builds/gitlab-kitware-sciviz-ci/build/lib64/catalyst" "-DCATALYST_EXAMPLES_CONTRACT_TAG:STRING=ParaViewCI-25.07")
16 set_tests_properties(contract-paraview-CxxOverlappingAMR PROPERTIES ENVIRONMENT "CTEST_OUTPUT_ON_FAILURE=1" LABELS "ParaViewContract" RUN_SERIAL "TRUE" _BACKTRACE_TRIPLES "/builds/gitlab-kitware-sciviz-ci/CMake/ParaViewContractTesting.cmake;85;add_test;/builds/gitlab-kitware-sciviz-ci/Examples/Catalyst2/CMakeLists.txt;12;paraview_contract_test;/builds/gitlab-kitware-sciviz-ci/Examples/Catalyst2/CMakeLists.txt;0;")
17 add_test(contract-paraview-CxxPolygonalWithAttributes "/builds/gitlab-kitware-sciviz-ci/.gitlab/cmake/bin/ctest" "--build-and-test" "/builds/gitlab-kitware-sciviz-ci/build/ContractTests/868cbddb/src" "/builds/gitlab-kitware-sciviz-ci/build/ContractTests/868cbddb/build" "--build-generator" "Ninja" "--build-makeprogram" "/builds/gitlab-kitware-sciviz-ci/.gitlab/ninja" "--build-options" "-DBUILD_SHARED_LIBS:BOOL=ON" "-DBUILD_TESTING=ON" "-DCMAKE_BUILD_TYPE=Release" "-Dcatalyst_DIR=/usr/lib64/openmpi/lib/cmake/catalyst-2.0" "-DParaViewCatalyst_DIR=/builds/gitlab-kitware-sciviz-ci/build/lib64/catalyst" "-DCATALYST_EXAMPLES_CONTRACT_TAG:STRING=ParaViewCI-25.07")
18 set_tests_properties(contract-paraview-CxxPolygonalWithAttributes PROPERTIES ENVIRONMENT "CTEST_OUTPUT_ON_FAILURE=1" LABELS "ParaViewContract" RUN_SERIAL "TRUE" _BACKTRACE_TRIPLES "/builds/gitlab-kitware-sciviz-ci/CMake/ParaViewContractTesting.cmake;85;add_test;/builds/gitlab-kitware-sciviz-ci/Examples/Catalyst2/CMakeLists.txt;12;paraview_contract_test;/builds/gitlab-kitware-sciviz-ci/Examples/Catalyst2/CMakeLists.txt;0;")
19 add_test(contract-paraview-CxxPolyhedra "/builds/gitlab-kitware-sciviz-ci/.gitlab/cmake/bin/ctest" "--build-and-test" "/builds/gitlab-kitware-sciviz-ci/build/ContractTests/f53997b8/src" "/builds/gitlab-kitware-sciviz-ci/build/ContractTests/f53997b8/build" "--build-generator" "Ninja" "--build-makeprogram" "/builds/gitlab-kitware-sciviz-ci/.gitlab/ninja" "--build-options" "-DBUILD_SHARED_LIBS:BOOL=ON" "-DBUILD_TESTING=ON" "-DCMAKE_BUILD_TYPE=Release" "-Dcatalyst_DIR=/usr/lib64/openmpi/lib/cmake/catalyst-2.0" "-DParaViewCatalyst_DIR=/builds/gitlab-kitware-sciviz-ci/build/lib64/catalyst" "-DCATALYST_EXAMPLES_CONTRACT_TAG:STRING=ParaViewCI-25.07")
20 set_tests_properties(contract-paraview-CxxPolyhedra PROPERTIES ENVIRONMENT "CTEST_OUTPUT_ON_FAILURE=1" LABELS "ParaViewContract" RUN_SERIAL "TRUE" _BACKTRACE_TRIPLES "/builds/gitlab-kitware-sciviz-ci/CMake/ParaViewContractTesting.cmake;85;add_test;/builds/gitlab-kitware-sciviz-ci/Examples/Catalyst2/CMakeLists.txt;12;paraview_contract_test;/builds/gitlab-kitware-sciviz-ci/Examples/Catalyst2/CMakeLists.txt;0;")
21 add_test(contract-paraview-CxxSteering "/builds/gitlab-kitware-sciviz-ci/.gitlab/cmake/bin/ctest" "--build-and-test" "/builds/gitlab-kitware-sciviz-ci/build/ContractTests/f5c61cfa/src" "/builds/gitlab-kitware-sciviz-ci/build/ContractTests/f5c61cfa/build" "--build-generator" "Ninja" "--build-makeprogram" "/builds/gitlab-kitware-sciviz-ci/.gitlab/ninja" "--build-options" "-DBUILD_SHARED_LIBS:BOOL=ON" "-DBUILD_TESTING=ON" "-DCMAKE_BUILD_TYPE=Release" "-Dcatalyst_DIR=/usr/lib64/openmpi/lib/cmake/catalyst-2.0" "-DParaViewCatalyst_DIR=/builds/gitlab-kitware-sciviz-ci/build/lib64/catalyst" "-DCATALYST_EXAMPLES_CONTRACT_TAG:STRING=ParaViewCI-25.07")
22 set_tests_properties(contract-paraview-CxxSteering PROPERTIES ENVIRONMENT "CTEST_OUTPUT_ON_FAILURE=1" LABELS "ParaViewContract" RUN_SERIAL "TRUE" _BACKTRACE_TRIPLES "/builds/gitlab-kitware-sciviz-ci/CMake/ParaViewContractTesting.cmake;85;add_test;/builds/gitlab-kitware-sciviz-ci/Examples/Catalyst2/CMakeLists.txt;12;paraview_contract_test;/builds/gitlab-kitware-sciviz-ci/Examples/Catalyst2/CMakeLists.txt;0;")
23 add_test(contract-paraview-CxxUnstructuredGrid "/builds/gitlab-kitware-sciviz-ci/.gitlab/cmake/bin/ctest" "--build-and-test" "/builds/gitlab-kitware-sciviz-ci/build/ContractTests/c8207eef/src" "/builds/gitlab-kitware-sciviz-ci/build/ContractTests/c8207eef/build" "--build-generator" "Ninja" "--build-makeprogram" "/builds/gitlab-kitware-sciviz-ci/.gitlab/ninja" "--build-options" "-DBUILD_SHARED_LIBS:BOOL=ON" "-DBUILD_TESTING=ON" "-DCMAKE_BUILD_TYPE=Release" "-Dcatalyst_DIR=/usr/lib64/openmpi/lib/cmake/catalyst-2.0" "-DParaViewCatalyst_DIR=/builds/gitlab-kitware-sciviz-ci/build/lib64/catalyst" "-DCATALYST_EXAMPLES_CONTRACT_TAG:STRING=ParaViewCI-25.07")
24 set_tests_properties(contract-paraview-CxxUnstructuredGrid PROPERTIES ENVIRONMENT "CTEST_OUTPUT_ON_FAILURE=1" LABELS "ParaViewContract" RUN_SERIAL "TRUE" _BACKTRACE_TRIPLES "/builds/gitlab-kitware-sciviz-ci/CMake/ParaViewContractTesting.cmake;85;add_test;/builds/gitlab-kitware-sciviz-ci/Examples/Catalyst2/CMakeLists.txt;12;paraview_contract_test;/builds/gitlab-kitware-sciviz-ci/Examples/Catalyst2/CMakeLists.txt;0;")
25 add_test(contract-paraview-Fortran90ImageData "/builds/gitlab-kitware-sciviz-ci/.gitlab/cmake/bin/ctest" "--build-and-test" "/builds/gitlab-kitware-sciviz-ci/build/ContractTests/d0cf62c0/src" "/builds/gitlab-kitware-sciviz-ci/build/ContractTests/d0cf62c0/build" "--build-generator" "Ninja" "--build-makeprogram" "/builds/gitlab-kitware-sciviz-ci/.gitlab/ninja" "--build-options" "-DBUILD_SHARED_LIBS:BOOL=ON" "-DBUILD_TESTING=ON" "-DCMAKE_BUILD_TYPE=Release" "-Dcatalyst_DIR=/usr/lib64/openmpi/lib/cmake/catalyst-2.0" "-DParaViewCatalyst_DIR=/builds/gitlab-kitware-sciviz-ci/build/lib64/catalyst" "-DCATALYST_EXAMPLES_CONTRACT_TAG:STRING=ParaViewCI-25.07")
26 set_tests_properties(contract-paraview-Fortran90ImageData PROPERTIES ENVIRONMENT "CTEST_OUTPUT_ON_FAILURE=1" LABELS "ParaViewContract" RUN_SERIAL "TRUE" _BACKTRACE_TRIPLES "/builds/gitlab-kitware-sciviz-ci/CMake/ParaViewContractTesting.cmake;85;add_test;/builds/gitlab-kitware-sciviz-ci/Examples/Catalyst2/CMakeLists.txt;12;paraview_contract_test;/builds/gitlab-kitware-sciviz-ci/Examples/Catalyst2/CMakeLists.txt;0;")
27 add_test(contract-paraview-PythonImageData "/builds/gitlab-kitware-sciviz-ci/.gitlab/cmake/bin/ctest" "--build-and-test" "/builds/gitlab-kitware-sciviz-ci/build/ContractTests/fbf54bae/src" "/builds/gitlab-kitware-sciviz-ci/build/ContractTests/fbf54bae/build" "--build-generator" "Ninja" "--build-makeprogram" "/builds/gitlab-kitware-sciviz-ci/.gitlab/ninja" "--build-options" "-DBUILD_SHARED_LIBS:BOOL=ON" "-DBUILD_TESTING=ON" "-DCMAKE_BUILD_TYPE=Release" "-Dcatalyst_DIR=/usr/lib64/openmpi/lib/cmake/catalyst-2.0" "-DParaViewCatalyst_DIR=/builds/gitlab-kitware-sciviz-ci/build/lib64/catalyst" "-DCATALYST_EXAMPLES_CONTRACT_TAG:STRING=ParaViewCI-25.07")
28 set_tests_properties(contract-paraview-PythonImageData PROPERTIES ENVIRONMENT "CTEST_OUTPUT_ON_FAILURE=1" LABELS "ParaViewContract" RUN_SERIAL "TRUE" _BACKTRACE_TRIPLES "/builds/gitlab-kitware-sciviz-ci/CMake/ParaViewContractTesting.cmake;85;add_test;/builds/gitlab-kitware-sciviz-ci/Examples/Catalyst2/CMakeLists.txt;12;paraview_contract_test;/builds/gitlab-kitware-sciviz-ci/Examples/Catalyst2/CMakeLists.txt;0;")
29 add_test(contract-paraview-PythonSteering "/builds/gitlab-kitware-sciviz-ci/.gitlab/cmake/bin/ctest" "--build-and-test" "/builds/gitlab-kitware-sciviz-ci/build/ContractTests/1ef2a0ae/src" "/builds/gitlab-kitware-sciviz-ci/build/ContractTests/1ef2a0ae/build" "--build-generator" "Ninja" "--build-makeprogram" "/builds/gitlab-kitware-sciviz-ci/.gitlab/ninja" "--build-options" "-DBUILD_SHARED_LIBS:BOOL=ON" "-DBUILD_TESTING=ON" "-DCMAKE_BUILD_TYPE=Release" "-Dcatalyst_DIR=/usr/lib64/openmpi/lib/cmake/catalyst-2.0" "-DParaViewCatalyst_DIR=/builds/gitlab-kitware-sciviz-ci/build/lib64/catalyst" "-DCATALYST_EXAMPLES_CONTRACT_TAG:STRING=ParaViewCI-25.07")
30 set_tests_properties(contract-paraview-PythonSteering PROPERTIES ENVIRONMENT "CTEST_OUTPUT_ON_FAILURE=1" LABELS "ParaViewContract" RUN_SERIAL "TRUE" _BACKTRACE_TRIPLES "/builds/gitlab-kitware-sciviz-ci/CMake/ParaViewContractTesting.cmake;85;add_test;/builds/gitlab-kitware-sciviz-ci/Examples/Catalyst2/CMakeLists.txt;12;paraview_contract_test;/builds/gitlab-kitware-sciviz-ci/Examples/Catalyst2/CMakeLists.txt;0;")